Negative coverage: borrow_check_statement / expr / premise borrow_check_expr( env, assumptions, state, expr, places_live_on_exit ) => (_init_ty, state)
Premise at line 232. Observed failure causes: failed_judgment.
expr| Line | Coverage | Source |
|---|---|---|
| 232 | 26 | (borrow_check_expr( env, assumptions, state, expr, places_live_on_exit ) => (_init_ty, state)) |
| ──────── ("expr") | ||
| 240 | 47 | (borrow_check_statement(env, assumptions, state, Stmt::Expr { expr }, places_live_on_exit) => (env, state)) |
26 tests failed proving this premise:
Source location: tests/borrowck.rs:446 (all coverage from this test)
fn foo() -> u32 {
let x: Pair;
x.first = 1_u32;
return 0_u32;
}
Failed proof tree
check_all_crates failedmod.rs:42args
rule "check all prefixes"mod.rs:54check_crate failedmod.rs:61args
rule "check crate"mod.rs:74check_crate_item failedmod.rs:179rule "free fn"mod.rs:207check_free_fn failedfns.rs:14args
rule "check free fn"fns.rs:24check_fn failedfns.rs:31args
rule "check fn"fns.rs:54check_fn_body failedfns.rs:61args
rule "expr fn body"fns.rs:89borrow_check failednll.rs:124args
rule "borrow_check"nll.rs:135borrow_check_block failednll.rs:142rule "basic block"nll.rs:157borrow_check_statement failednll.rs:174args
rule "expr"nll.rs:232borrow_check_expr failednll.rs:371args
rule "assign"nll.rs:416access_permitted failednll.rs:862args
rule "access_permitted"nll.rs:874 (failed: if_false)
Source location: tests/borrowck.rs:2347 (all coverage from this test)
fn foo() -> i32 {
exists<'r0, 'r1> {
let v1: i32 = 0_i32;
let v2: &'r0 mut i32 = &'r1 mut v1;
// This should result in an error
v1 = 1_i32;
return *v2;
}
}
Failed proof tree
check_all_crates failedmod.rs:42args
rule "check all prefixes"mod.rs:54check_crate failedmod.rs:61args
rule "check crate"mod.rs:74check_crate_item failedmod.rs:179rule "free fn"mod.rs:207check_free_fn failedfns.rs:14args
rule "check free fn"fns.rs:24check_fn failedfns.rs:31args
rule "check fn"fns.rs:54check_fn_body failedfns.rs:61args
rule "expr fn body"fns.rs:89borrow_check failednll.rs:124args
rule "borrow_check"nll.rs:135borrow_check_block failednll.rs:142rule "basic block"nll.rs:157borrow_check_statement failednll.rs:174args
rule "exists"nll.rs:302borrow_check_block failednll.rs:142args
rule "basic block"nll.rs:157borrow_check_statement failednll.rs:174args
rule "expr"nll.rs:232borrow_check_expr failednll.rs:371args
rule "assign"nll.rs:416access_permitted failednll.rs:862args
rule "access_permitted"nll.rs:878access_permitted_by_loans failednll.rs:885rule "access_permitted_by_loans"nll.rs:898access_permitted_by_loan failednll.rs:905args
rule "borrow of disjoint places"nll.rs:920 (failed: if_false)rule "loan is dead"nll.rs:967loan_not_required_by_live_places failednll.rs:1296args
rule "loan_not_required_by_live_places"nll.rs:1321loan_not_required_by_live_place failednll.rs:1328args
rule "loan is not required by type"nll.rs:1348loan_not_required_by_parameter failednll.rs:1396args
rule "alias-ty RFC 1214"nll.rs:1432loan_not_required_by_parameters failednll.rs:1533args
rule "loan_not_required_by_parameters"nll.rs:1554loan_not_required_by_parameter failednll.rs:1396args
rule "rigid-ty"nll.rs:1416loan_not_required_by_parameters failednll.rs:1533args
rule "loan_not_required_by_parameters"nll.rs:1554loan_not_required_by_parameter failednll.rs:1396args
rule "lifetime"nll.rs:1506loan_cannot_outlive failednll.rs:1513args
rule "loan_cannot_outlive"nll.rs:1526 (failed: if_false)
rule "write-indirect"nll.rs:947 (failed: if_let)
Source location: tests/borrowck.rs:2385 (all coverage from this test)
fn foo() -> i32 {
exists<'r0, 'r1> {
let v1: i32 = 0_i32;
let v2: &'r0 i32 = &'r1 v1;
v1 = 1_i32;
return *v2;
}
}
Failed proof tree
check_all_crates failedmod.rs:42args
rule "check all prefixes"mod.rs:54check_crate failedmod.rs:61args
rule "check crate"mod.rs:74check_crate_item failedmod.rs:179rule "free fn"mod.rs:207check_free_fn failedfns.rs:14args
rule "check free fn"fns.rs:24check_fn failedfns.rs:31args
rule "check fn"fns.rs:54check_fn_body failedfns.rs:61args
rule "expr fn body"fns.rs:89borrow_check failednll.rs:124args
rule "borrow_check"nll.rs:135borrow_check_block failednll.rs:142rule "basic block"nll.rs:157borrow_check_statement failednll.rs:174args
rule "exists"nll.rs:302borrow_check_block failednll.rs:142args
rule "basic block"nll.rs:157borrow_check_statement failednll.rs:174args
rule "expr"nll.rs:232borrow_check_expr failednll.rs:371args
rule "assign"nll.rs:416access_permitted failednll.rs:862args
rule "access_permitted"nll.rs:878access_permitted_by_loans failednll.rs:885rule "access_permitted_by_loans"nll.rs:898access_permitted_by_loan failednll.rs:905args
rule "borrow of disjoint places"nll.rs:920 (failed: if_false)rule "loan is dead"nll.rs:967loan_not_required_by_live_places failednll.rs:1296args
rule "loan_not_required_by_live_places"nll.rs:1321loan_not_required_by_live_place failednll.rs:1328args
rule "loan is not required by type"nll.rs:1348loan_not_required_by_parameter failednll.rs:1396args
rule "alias-ty RFC 1214"nll.rs:1432loan_not_required_by_parameters failednll.rs:1533args
rule "loan_not_required_by_parameters"nll.rs:1554loan_not_required_by_parameter failednll.rs:1396args
rule "rigid-ty"nll.rs:1416loan_not_required_by_parameters failednll.rs:1533args
rule "loan_not_required_by_parameters"nll.rs:1554loan_not_required_by_parameter failednll.rs:1396args
rule "lifetime"nll.rs:1506loan_cannot_outlive failednll.rs:1513args
rule "loan_cannot_outlive"nll.rs:1526 (failed: if_false)
rule "write-indirect"nll.rs:947 (failed: if_let)
Source location: tests/borrowck.rs:2419 (all coverage from this test)
fn foo() -> i32 {
exists<'r> {
let v3: i32 = 0_i32;
let v4: &'r i32 = &'r v3;
}
exists<'r0, 'r1> {
let v1: i32 = 0_i32;
let v2: &'r0 i32 = &'r1 v1;
v1 = 1_i32;
return *v2;
}
}
Failed proof tree
check_all_crates failedmod.rs:42args
rule "check all prefixes"mod.rs:54check_crate failedmod.rs:61args
rule "check crate"mod.rs:74check_crate_item failedmod.rs:179rule "free fn"mod.rs:207check_free_fn failedfns.rs:14args
rule "check free fn"fns.rs:24check_fn failedfns.rs:31args
rule "check fn"fns.rs:54check_fn_body failedfns.rs:61args
rule "expr fn body"fns.rs:89borrow_check failednll.rs:124args
rule "borrow_check"nll.rs:135borrow_check_block failednll.rs:142rule "basic block"nll.rs:157borrow_check_statement failednll.rs:174args
rule "exists"nll.rs:302borrow_check_block failednll.rs:142args
rule "basic block"nll.rs:157borrow_check_statement failednll.rs:174args
rule "expr"nll.rs:232borrow_check_expr failednll.rs:371args
rule "assign"nll.rs:416access_permitted failednll.rs:862args
rule "access_permitted"nll.rs:878access_permitted_by_loans failednll.rs:885rule "access_permitted_by_loans"nll.rs:898access_permitted_by_loan failednll.rs:905args
rule "borrow of disjoint places"nll.rs:920 (failed: if_false)rule "loan is dead"nll.rs:967loan_not_required_by_live_places failednll.rs:1296args
rule "loan_not_required_by_live_places"nll.rs:1321loan_not_required_by_live_place failednll.rs:1328args
rule "loan is not required by type"nll.rs:1348loan_not_required_by_parameter failednll.rs:1396args
rule "alias-ty RFC 1214"nll.rs:1432loan_not_required_by_parameters failednll.rs:1533args
rule "loan_not_required_by_parameters"nll.rs:1554loan_not_required_by_parameter failednll.rs:1396args
rule "rigid-ty"nll.rs:1416loan_not_required_by_parameters failednll.rs:1533args
rule "loan_not_required_by_parameters"nll.rs:1554loan_not_required_by_parameter failednll.rs:1396args
rule "lifetime"nll.rs:1506loan_cannot_outlive failednll.rs:1513args
rule "loan_cannot_outlive"nll.rs:1526 (failed: if_false)
rule "write-indirect"nll.rs:947 (failed: if_let)
Source location: tests/borrowck.rs:2734 (all coverage from this test)
fn foo<'a, 'b>(v1: &'a u32, v2: &'b u32) -> () {
let output: &'b u32 = v2;
loop {
output = v1;
}
}
Failed proof tree
check_all_crates failedmod.rs:42args
rule "check all prefixes"mod.rs:54check_crate failedmod.rs:61args
rule "check crate"mod.rs:74check_crate_item failedmod.rs:179rule "free fn"mod.rs:207check_free_fn failedfns.rs:14args
rule "check free fn"fns.rs:24check_fn failedfns.rs:31args
rule "check fn"fns.rs:54check_fn_body failedfns.rs:61args
rule "expr fn body"fns.rs:89borrow_check failednll.rs:124args
rule "borrow_check"nll.rs:135borrow_check_block failednll.rs:142rule "basic block"nll.rs:157borrow_check_statement failednll.rs:174args
rule "loop"nll.rs:249borrow_check_loop failednll.rs:640args
rule "fixed-point"nll.rs:660borrow_check_block failednll.rs:142args
rule "basic block"nll.rs:157borrow_check_statement failednll.rs:174args
rule "expr"nll.rs:232borrow_check_expr failednll.rs:371args
rule "assign"nll.rs:414prove_assignable failednll.rs:1132args
rule "subtype"nll.rs:1150verify_universal_outlives failedoutlives.rs:8args
rule "verify_universal_outlives"outlives.rs:20only_assumed_outlives failedoutlives.rs:27args
rule "universal lifetime"outlives.rs:49can_outlive failedoutlives.rs:56args
rule "universal target"outlives.rs:81prove failedoutlives.rs:81args
ruleoutlives.rs:81prove_predicate_list failedprove_predicate_list.rs:8args
rule "some"prove_predicate_list.rs:26prove_predicate failedprove_predicate.rs:22args
rule "outlives"prove_predicate.rs:142prove_outlives failedprove_outlives.rs:8args
rule "assign"nll.rs:414prove_assignable failednll.rs:1132args
rule "subtype"nll.rs:1150verify_universal_outlives failedoutlives.rs:8args
rule "verify_universal_outlives"outlives.rs:20only_assumed_outlives failedoutlives.rs:27args
rule "universal lifetime"outlives.rs:49can_outlive failedoutlives.rs:56args
rule "universal target"outlives.rs:81prove failedoutlives.rs:81args
ruleoutlives.rs:81prove_predicate_list failedprove_predicate_list.rs:8args
rule "some"prove_predicate_list.rs:26prove_predicate failedprove_predicate.rs:22args
rule "outlives"prove_predicate.rs:142prove_outlives failedprove_outlives.rs:8args
rule "loop"nll.rs:652borrow_check_block failednll.rs:142args
rule "basic block"nll.rs:157borrow_check_statement failednll.rs:174args
rule "expr"nll.rs:232borrow_check_expr failednll.rs:371args
rule "assign"nll.rs:414prove_assignable failednll.rs:1132args
rule "subtype"nll.rs:1150verify_universal_outlives failedoutlives.rs:8args
rule "verify_universal_outlives"outlives.rs:20only_assumed_outlives failedoutlives.rs:27args
rule "universal lifetime"outlives.rs:49can_outlive failedoutlives.rs:56args
rule "universal target"outlives.rs:81prove failedoutlives.rs:81args
ruleoutlives.rs:81prove_predicate_list failedprove_predicate_list.rs:8args
rule "some"prove_predicate_list.rs:26prove_predicate failedprove_predicate.rs:22args
rule "outlives"prove_predicate.rs:142prove_outlives failedprove_outlives.rs:8args
rule "assign"nll.rs:414prove_assignable failednll.rs:1132args
rule "subtype"nll.rs:1150verify_universal_outlives failedoutlives.rs:8args
rule "verify_universal_outlives"outlives.rs:20only_assumed_outlives failedoutlives.rs:27args
rule "universal lifetime"outlives.rs:49can_outlive failedoutlives.rs:56args
rule "universal target"outlives.rs:81prove failedoutlives.rs:81args
ruleoutlives.rs:81prove_predicate_list failedprove_predicate_list.rs:8args
rule "some"prove_predicate_list.rs:26prove_predicate failedprove_predicate.rs:22args
rule "outlives"prove_predicate.rs:142prove_outlives failedprove_outlives.rs:8args
rule "basic block"nll.rs:157borrow_check_statement failednll.rs:174args
rule "loop"nll.rs:249borrow_check_loop failednll.rs:640args
rule "fixed-point"nll.rs:660borrow_check_block failednll.rs:142args
rule "basic block"nll.rs:157borrow_check_statement failednll.rs:174args
rule "expr"nll.rs:232borrow_check_expr failednll.rs:371args
rule "assign"nll.rs:414prove_assignable failednll.rs:1132args
rule "subtype"nll.rs:1150verify_universal_outlives failedoutlives.rs:8args
rule "verify_universal_outlives"outlives.rs:20only_assumed_outlives failedoutlives.rs:27args
rule "universal lifetime"outlives.rs:49can_outlive failedoutlives.rs:56args
rule "universal target"outlives.rs:81prove failedoutlives.rs:81args
ruleoutlives.rs:81prove_predicate_list failedprove_predicate_list.rs:8args
rule "some"prove_predicate_list.rs:26prove_predicate failedprove_predicate.rs:22args
rule "outlives"prove_predicate.rs:142prove_outlives failedprove_outlives.rs:8args
rule "assign"nll.rs:414prove_assignable failednll.rs:1132args
rule "subtype"nll.rs:1150verify_universal_outlives failedoutlives.rs:8args
rule "verify_universal_outlives"outlives.rs:20only_assumed_outlives failedoutlives.rs:27args
rule "universal lifetime"outlives.rs:49can_outlive failedoutlives.rs:56args
rule "universal target"outlives.rs:81prove failedoutlives.rs:81args
ruleoutlives.rs:81prove_predicate_list failedprove_predicate_list.rs:8args
rule "some"prove_predicate_list.rs:26prove_predicate failedprove_predicate.rs:22args
rule "outlives"prove_predicate.rs:142prove_outlives failedprove_outlives.rs:8args
rule "loop"nll.rs:652borrow_check_block failednll.rs:142args
rule "basic block"nll.rs:157borrow_check_statement failednll.rs:174args
rule "expr"nll.rs:232borrow_check_expr failednll.rs:371args
rule "assign"nll.rs:414prove_assignable failednll.rs:1132args
rule "subtype"nll.rs:1150verify_universal_outlives failedoutlives.rs:8args
rule "verify_universal_outlives"outlives.rs:20only_assumed_outlives failedoutlives.rs:27args
rule "universal lifetime"outlives.rs:49can_outlive failedoutlives.rs:56args
rule "universal target"outlives.rs:81prove failedoutlives.rs:81args
ruleoutlives.rs:81prove_predicate_list failedprove_predicate_list.rs:8args
rule "some"prove_predicate_list.rs:26prove_predicate failedprove_predicate.rs:22args
rule "outlives"prove_predicate.rs:142prove_outlives failedprove_outlives.rs:8args
rule "assign"nll.rs:414prove_assignable failednll.rs:1132args
rule "subtype"nll.rs:1150verify_universal_outlives failedoutlives.rs:8args
rule "verify_universal_outlives"outlives.rs:20only_assumed_outlives failedoutlives.rs:27args
rule "universal lifetime"outlives.rs:49can_outlive failedoutlives.rs:56args
rule "universal target"outlives.rs:81prove failedoutlives.rs:81args
ruleoutlives.rs:81prove_predicate_list failedprove_predicate_list.rs:8args
rule "some"prove_predicate_list.rs:26prove_predicate failedprove_predicate.rs:22args
rule "outlives"prove_predicate.rs:142prove_outlives failedprove_outlives.rs:8args
Source location: tests/borrowck.rs:3030 (all coverage from this test)
fn foo() -> i32 {
exists<'r0, 'r1> {
let x: i32 = 0_i32;
let r: &'r0 i32;
'a: loop {
r; // this *may* read from `y` in a previous iteration
let y: i32 = 0_i32;
r = &'r1 y;
continue 'a;
}
}
}
Failed proof tree
check_all_crates failedmod.rs:42args
rule "check all prefixes"mod.rs:54check_crate failedmod.rs:61args
rule "check crate"mod.rs:74check_crate_item failedmod.rs:179rule "free fn"mod.rs:207check_free_fn failedfns.rs:14args
rule "check free fn"fns.rs:24check_fn failedfns.rs:31args
rule "check fn"fns.rs:54check_fn_body failedfns.rs:61args
rule "expr fn body"fns.rs:89borrow_check failednll.rs:124args
rule "borrow_check"nll.rs:135borrow_check_block failednll.rs:142rule "basic block"nll.rs:157borrow_check_statement failednll.rs:174args
rule "exists"nll.rs:302borrow_check_block failednll.rs:142args
rule "basic block"nll.rs:157borrow_check_statement failednll.rs:174args
rule "loop"nll.rs:249borrow_check_loop failednll.rs:640args
rule "fixed-point"nll.rs:660borrow_check_block failednll.rs:142args
rule "basic block"nll.rs:157borrow_check_statement failednll.rs:174args
rule "expr"nll.rs:232borrow_check_expr failednll.rs:371args
rule "place"nll.rs:547access_permitted failednll.rs:862args
rule "access_permitted"nll.rs:874 (failed: if_false)
rule "place"nll.rs:547access_permitted failednll.rs:862args
rule "access_permitted"nll.rs:874 (failed: if_false)
rule "loop"nll.rs:652borrow_check_block failednll.rs:142args
rule "basic block"nll.rs:157borrow_check_statement failednll.rs:174args
rule "expr"nll.rs:232borrow_check_expr failednll.rs:371args
rule "place"nll.rs:547access_permitted failednll.rs:862args
rule "access_permitted"nll.rs:874 (failed: if_false)
rule "place"nll.rs:547access_permitted failednll.rs:862args
rule "access_permitted"nll.rs:874 (failed: if_false)
Source location: tests/borrowck.rs:3227 (all coverage from this test)
fn foo() -> u32 {
exists<'r0, 'r1> {
let a: u32 = 22_u32;
let p: &'r0 u32 = &'r1 a;
'l: loop {
if true {
a = 23_u32;
continue 'l;
} else {
break 'l;
}
}
return *p;
}
}
Failed proof tree
check_all_crates failedmod.rs:42args
rule "check all prefixes"mod.rs:54check_crate failedmod.rs:61args
rule "check crate"mod.rs:74check_crate_item failedmod.rs:179rule "free fn"mod.rs:207check_free_fn failedfns.rs:14args
rule "check free fn"fns.rs:24check_fn failedfns.rs:31args
rule "check fn"fns.rs:54check_fn_body failedfns.rs:61args
rule "expr fn body"fns.rs:89borrow_check failednll.rs:124args
rule "borrow_check"nll.rs:135borrow_check_block failednll.rs:142rule "basic block"nll.rs:157borrow_check_statement failednll.rs:174args
rule "exists"nll.rs:302borrow_check_block failednll.rs:142args
rule "basic block"nll.rs:157borrow_check_statement failednll.rs:174args
rule "loop"nll.rs:249borrow_check_loop failednll.rs:640args
rule "fixed-point"nll.rs:660borrow_check_block failednll.rs:142args
rule "basic block"nll.rs:157borrow_check_statement failednll.rs:174args
rule "if"nll.rs:222borrow_check_block failednll.rs:142args
rule "basic block"nll.rs:157borrow_check_statement failednll.rs:174args
rule "expr"nll.rs:232borrow_check_expr failednll.rs:371args
rule "assign"nll.rs:416access_permitted failednll.rs:862args
rule "access_permitted"nll.rs:878access_permitted_by_loans failednll.rs:885rule "access_permitted_by_loans"nll.rs:898access_permitted_by_loan failednll.rs:905args
rule "borrow of disjoint places"nll.rs:920 (failed: if_false)rule "loan is dead"nll.rs:967loan_not_required_by_live_places failednll.rs:1296args
rule "loan_not_required_by_live_places"nll.rs:1321loan_not_required_by_live_place failednll.rs:1328args
rule "loan is not required by type"nll.rs:1348loan_not_required_by_parameter failednll.rs:1396args
rule "alias-ty RFC 1214"nll.rs:1432loan_not_required_by_parameters failednll.rs:1533args
rule "loan_not_required_by_parameters"nll.rs:1554loan_not_required_by_parameter failednll.rs:1396args
rule "rigid-ty"nll.rs:1416loan_not_required_by_parameters failednll.rs:1533args
rule "loan_not_required_by_parameters"nll.rs:1554loan_not_required_by_parameter failednll.rs:1396args
rule "lifetime"nll.rs:1506loan_cannot_outlive failednll.rs:1513args
rule "loan_cannot_outlive"nll.rs:1526 (failed: if_false)
rule "write-indirect"nll.rs:947 (failed: if_let)
rule "loop"nll.rs:652borrow_check_block failednll.rs:142args
rule "basic block"nll.rs:157borrow_check_statement failednll.rs:174args
rule "if"nll.rs:222borrow_check_block failednll.rs:142args
rule "basic block"nll.rs:157borrow_check_statement failednll.rs:174args
rule "expr"nll.rs:232borrow_check_expr failednll.rs:371args
rule "assign"nll.rs:416access_permitted failednll.rs:862args
rule "access_permitted"nll.rs:878access_permitted_by_loans failednll.rs:885rule "access_permitted_by_loans"nll.rs:898access_permitted_by_loan failednll.rs:905args
rule "borrow of disjoint places"nll.rs:920 (failed: if_false)rule "loan is dead"nll.rs:967loan_not_required_by_live_places failednll.rs:1296args
rule "loan_not_required_by_live_places"nll.rs:1321loan_not_required_by_live_place failednll.rs:1328args
rule "loan is not required by type"nll.rs:1348loan_not_required_by_parameter failednll.rs:1396args
rule "alias-ty RFC 1214"nll.rs:1432loan_not_required_by_parameters failednll.rs:1533args
rule "loan_not_required_by_parameters"nll.rs:1554loan_not_required_by_parameter failednll.rs:1396args
rule "rigid-ty"nll.rs:1416loan_not_required_by_parameters failednll.rs:1533args
rule "loan_not_required_by_parameters"nll.rs:1554loan_not_required_by_parameter failednll.rs:1396args
rule "lifetime"nll.rs:1506loan_cannot_outlive failednll.rs:1513args
rule "loan_cannot_outlive"nll.rs:1526 (failed: if_false)
rule "write-indirect"nll.rs:947 (failed: if_let)
Source location: tests/borrowck.rs:3352 (all coverage from this test)
fn foo() -> u32 {
exists<'r0, 'r1, 'r2> {
let a: u32 = 22_u32;
let b: u32 = 22_u32;
let p: &'r0 u32 = &'r1 a;
a = 23_u32;
'l: loop {
p = &'r2 b;
break 'l;
}
return *p;
}
}
Failed proof tree
check_all_crates failedmod.rs:42args
rule "check all prefixes"mod.rs:54check_crate failedmod.rs:61args
rule "check crate"mod.rs:74check_crate_item failedmod.rs:179rule "free fn"mod.rs:207check_free_fn failedfns.rs:14args
rule "check free fn"fns.rs:24check_fn failedfns.rs:31args
rule "check fn"fns.rs:54check_fn_body failedfns.rs:61args
rule "expr fn body"fns.rs:89borrow_check failednll.rs:124args
rule "borrow_check"nll.rs:135borrow_check_block failednll.rs:142rule "basic block"nll.rs:157borrow_check_statement failednll.rs:174args
rule "exists"nll.rs:302borrow_check_block failednll.rs:142args
rule "basic block"nll.rs:157borrow_check_statement failednll.rs:174args
rule "expr"nll.rs:232borrow_check_expr failednll.rs:371args
rule "assign"nll.rs:416access_permitted failednll.rs:862args
rule "access_permitted"nll.rs:878access_permitted_by_loans failednll.rs:885rule "access_permitted_by_loans"nll.rs:898access_permitted_by_loan failednll.rs:905args
rule "borrow of disjoint places"nll.rs:920 (failed: if_false)rule "loan is dead"nll.rs:967loan_not_required_by_live_places failednll.rs:1296args
rule "loan_not_required_by_live_places"nll.rs:1321loan_not_required_by_live_place failednll.rs:1328args
rule "loan is not required by type"nll.rs:1348loan_not_required_by_parameter failednll.rs:1396args
rule "alias-ty RFC 1214"nll.rs:1432loan_not_required_by_parameters failednll.rs:1533args
rule "loan_not_required_by_parameters"nll.rs:1554loan_not_required_by_parameter failednll.rs:1396args
rule "rigid-ty"nll.rs:1416loan_not_required_by_parameters failednll.rs:1533args
rule "loan_not_required_by_parameters"nll.rs:1554loan_not_required_by_parameter failednll.rs:1396args
rule "lifetime"nll.rs:1506loan_cannot_outlive failednll.rs:1513args
rule "loan_cannot_outlive"nll.rs:1526 (failed: if_false)
rule "write-indirect"nll.rs:947 (failed: if_let)
Source location: tests/borrowck.rs:3584 (all coverage from this test)
fn foo() -> u32 {
exists<'r0, 'r1> {
let p: Point = Point { x: 0_u32, y: 0_u32 };
let b1: &'r0 mut u32 = &'r1 mut p.x;
p.x = 1_u32;
return *b1;
}
}
Failed proof tree
check_all_crates failedmod.rs:42args
rule "check all prefixes"mod.rs:54check_crate failedmod.rs:61args
rule "check crate"mod.rs:74check_crate_item failedmod.rs:179rule "free fn"mod.rs:207check_free_fn failedfns.rs:14args
rule "check free fn"fns.rs:24check_fn failedfns.rs:31args
rule "check fn"fns.rs:54check_fn_body failedfns.rs:61args
rule "expr fn body"fns.rs:89borrow_check failednll.rs:124args
rule "borrow_check"nll.rs:135borrow_check_block failednll.rs:142rule "basic block"nll.rs:157borrow_check_statement failednll.rs:174args
rule "exists"nll.rs:302borrow_check_block failednll.rs:142args
rule "basic block"nll.rs:157borrow_check_statement failednll.rs:174args
rule "expr"nll.rs:232borrow_check_expr failednll.rs:371args
rule "assign"nll.rs:416access_permitted failednll.rs:862args
rule "access_permitted"nll.rs:878access_permitted_by_loans failednll.rs:885rule "access_permitted_by_loans"nll.rs:898access_permitted_by_loan failednll.rs:905args
rule "borrow of disjoint places"nll.rs:920 (failed: if_false)rule "loan is dead"nll.rs:967loan_not_required_by_live_places failednll.rs:1296args
rule "loan_not_required_by_live_places"nll.rs:1321loan_not_required_by_live_place failednll.rs:1328args
rule "loan is not required by type"nll.rs:1348loan_not_required_by_parameter failednll.rs:1396args
rule "alias-ty RFC 1214"nll.rs:1432loan_not_required_by_parameters failednll.rs:1533args
rule "loan_not_required_by_parameters"nll.rs:1554loan_not_required_by_parameter failednll.rs:1396args
rule "rigid-ty"nll.rs:1416loan_not_required_by_parameters failednll.rs:1533args
rule "loan_not_required_by_parameters"nll.rs:1554loan_not_required_by_parameter failednll.rs:1396args
rule "lifetime"nll.rs:1506loan_cannot_outlive failednll.rs:1513args
rule "loan_cannot_outlive"nll.rs:1526 (failed: if_false)
rule "write-indirect"nll.rs:947 (failed: if_let)rule "write-indirect"nll.rs:947 (failed: if_let)
Source location: tests/borrowck.rs:3658 (all coverage from this test)
fn foo() -> u32 {
exists<'r0> {
let v1: u32 = 0_u32;
let w: Wrapper<'r0> = Wrapper::<'r0> { value: &'r0 mut v1 };
v1 = 1_u32;
return *(w.value);
}
}
Failed proof tree
check_all_crates failedmod.rs:42args
rule "check all prefixes"mod.rs:54check_crate failedmod.rs:61args
rule "check crate"mod.rs:74check_crate_item failedmod.rs:179rule "free fn"mod.rs:207check_free_fn failedfns.rs:14args
rule "check free fn"fns.rs:24check_fn failedfns.rs:31args
rule "check fn"fns.rs:54check_fn_body failedfns.rs:61args
rule "expr fn body"fns.rs:89borrow_check failednll.rs:124args
rule "borrow_check"nll.rs:135borrow_check_block failednll.rs:142rule "basic block"nll.rs:157borrow_check_statement failednll.rs:174args
rule "exists"nll.rs:302borrow_check_block failednll.rs:142args
rule "basic block"nll.rs:157borrow_check_statement failednll.rs:174args
rule "expr"nll.rs:232borrow_check_expr failednll.rs:371args
rule "assign"nll.rs:416access_permitted failednll.rs:862args
rule "access_permitted"nll.rs:878access_permitted_by_loans failednll.rs:885rule "access_permitted_by_loans"nll.rs:898access_permitted_by_loan failednll.rs:905args
rule "borrow of disjoint places"nll.rs:920 (failed: if_false)rule "loan is dead"nll.rs:967loan_not_required_by_live_places failednll.rs:1296args
rule "loan_not_required_by_live_places"nll.rs:1321loan_not_required_by_live_place failednll.rs:1328args
rule "loan is not required by type"nll.rs:1348loan_not_required_by_parameter failednll.rs:1396args
rule "alias-ty RFC 1214"nll.rs:1432loan_not_required_by_parameters failednll.rs:1533args
rule "loan_not_required_by_parameters"nll.rs:1554loan_not_required_by_parameter failednll.rs:1396args
rule "rigid-ty"nll.rs:1416loan_not_required_by_parameters failednll.rs:1533args
rule "loan_not_required_by_parameters"nll.rs:1554loan_not_required_by_parameter failednll.rs:1396args
rule "lifetime"nll.rs:1506loan_cannot_outlive failednll.rs:1513args
rule "loan_cannot_outlive"nll.rs:1526 (failed: if_false)
rule "write-indirect"nll.rs:947 (failed: if_let)
Source location: tests/borrowck.rs:3813 (all coverage from this test)
fn foo() -> u32 {
exists<'r0, 'r1, 'r2> {
let x: u32 = 22_u32;
let p: &'r1 u32 = &'r0 x;
let q: &'r2 u32 = p;
x = 1_u32;
q;
return 0_u32;
}
}
Proof trees omitted for the remaining 16 tests; each one is on its test’s page in Coverage by test.
Source location: tests/borrowck.rs:4007 (all coverage from this test)
fn foo() -> u32 {
exists<'r0, 'r1> {
let x: u32 = 22_u32;
let helper: &'r1 u32 = &'r0 x;
x = 1_u32;
helper;
return 0_u32;
}
}
Source location: tests/borrowck.rs:4214 (all coverage from this test)
fn remove_last_node_iterative<'a>(node: &'a mut List) -> u32 {
exists<'r0, 'r1> {
let cursor: &'r0 mut List = &'r0 mut *node;
'l: loop {
let next: &'r1 mut List = &'r1 mut *cursor;
if true {
cursor = next;
} else {
break 'l;
}
}
*cursor = List { value: 0_u32 };
return 0_u32;
}
}
Source location: tests/borrowck.rs:4862 (all coverage from this test)
fn use_both<'a, 'b>() -> u32 {
exists<'r0> {
let v: Invariant<'r0> = create_invariant::<'r0>();
let w: Invariant<'r0> = create_invariant::<'r0>();
sink::<'a, 'r0>(v);
sink::<'b, 'r0>(w);
return 0_u32;
}
}
Source location: tests/borrowck.rs:5052 (all coverage from this test)
fn foo() -> () {
let x: u32 = 1_u32;
exists<'r0> {
let r: &'r0 u32 = &'r0 x;
x += 1_u32;
let y: u32 = *r;
}
}
Source location: tests/borrowck.rs:5096 (all coverage from this test)
fn foo() -> () {
let x: u32;
x += 1_u32;
}
Source location: tests/borrowck.rs:5149 (all coverage from this test)
fn foo() -> () {
let x: u32 = 1_u32;
exists<'a> {
let r: &'a mut u32 = &'a mut x;
x = x + *r;
}
}
Source location: tests/borrowck.rs:5201 (all coverage from this test)
fn foo() -> () {
let x: u32 = 1_u32;
exists<'a> {
let r: &'a mut u32 = &'a mut x;
x += *r;
let y: u32 = *r;
}
}
Source location: tests/borrowck.rs:5253 (all coverage from this test)
fn foo() -> () {
let x: u32 = 1_u32;
exists<'a> {
let r: &'a mut u32 = &'a mut x;
*r += x;
}
}
Source location: tests/mir_typeck.rs:791 (all coverage from this test)
fn foo (v1: u32) -> u32 {
let v2: Dummy = Dummy { value: 1_u32 };
v2.nonexistent = 2_u32;
return v1;
}
Source location: tests/mir_typeck.rs:820 (all coverage from this test)
fn foo (v1: u32) -> u32 {
let v2: Dummy = Dummy { value: 1_u32 };
v1.value = 2_u32;
return v1;
}
Source location: tests/mir_typeck.rs:1394 (all coverage from this test)
fn main() -> () { require_marker::<S>; }
}])
tc_err(expect_test::expect![[r#"
error[E0277]: the trait bound `S: Marker` is not satisfied
--> lib.rs
|
13 | require_marker::<S>;
| ^ unsatisfied trait bound
|
help: the trait `Marker` is not implemented for `S`
--> lib.rs
|
3 | pub struct S {}
| ^^^^^^^^^^^^
help: this trait has no implementations, consider adding one
--> lib.rs
|
1 | pub trait Marker {}
| ^^^^^^^^^^^^^^^^
note: required by a bound in `require_marker`
--> lib.rs
|
5 | pub fn require_marker<T00>() -> ()
| -------------- required by a bound in this function
6 | where
7 | T00: Marker,
| ^^^^^^ required by this bound in `require_marker`
For more information about this error, try `rustc --explain E0277`.
error: could not compile `test` (lib) due to 1 previous error
)
(expect_test::expect![[r#"
the rule "trait implied bound" at (prove_predicate.rs) failed because
expression evaluated to an empty collection: `decls.trait_invariants()`"#]]);
}
ing the same function is still rejected. The where-clauses are now
ked both for the function name and by the call.
#[test]
generic_fn_call_with_unsatisfied_where_clause() {
alityTest::new(crates![crate test {
trait Marker {}
struct S {}
fn require_marker<T>() -> () where T: Marker { trusted }
fn main() -> () { require_marker::<S>(); }
}])
tc_err(expect_test::expect![[r#"
error[E0277]: the trait bound `S: Marker` is not satisfied
--> lib.rs
|
13 | require_marker::<S>();
| ^ unsatisfied trait bound
|
help: the trait `Marker` is not implemented for `S`
--> lib.rs
|
3 | pub struct S {}
| ^^^^^^^^^^^^
help: this trait has no implementations, consider adding one
--> lib.rs
|
1 | pub trait Marker {}
| ^^^^^^^^^^^^^^^^
note: required by a bound in `require_marker`
--> lib.rs
|
5 | pub fn require_marker<T00>() -> ()
| -------------- required by a bound in this function
6 | where
7 | T00: Marker,
| ^^^^^^ required by this bound in `require_marker`
For more information about this error, try `rustc --explain E0277`.
error: could not compile `test` (lib) due to 1 previous error
)
(expect_test::expect![[r#"
the rule "trait implied bound" at (prove_predicate.rs) failed because
expression evaluated to an empty collection: `decls.trait_invariants()`"#]]);
}
ng the function with a type that implements `Marker` is accepted.
#[test]
generic_fn_value_with_satisfied_where_clause() {
alityTest::new(crates![crate test {
trait Marker {}
impl Marker for u32 {}
fn require_marker<T>() -> () where T: Marker {}
fn main() -> () { require_marker::<u32>; }
}])
tc_ok()
);
}
#[test]
fn_value_with_forwarded_trait_bound() {
alityTest::new(crates![crate Foo {
trait Marker {}
impl Marker for u32 {}
fn require<T>() -> () where T: Marker {}
fn outer<T>() -> () where T: Marker { require::<T>; }
fn main() -> () { outer::<u32>(); }
}])
tc_ok()
);
}
#[test]
bare_fn_value_with_satisfied_where_clause() {
alityTest::new(crates![crate Foo {
trait Marker {}
impl Marker for u32 {}
fn require() -> () where u32: Marker {}
fn main() -> () { require; }
}])
tc_ok()
);
}
#[test]
fn_value_with_forwarded_lifetime_bound() {
alityTest::new(crates![crate Foo {
fn require<'a, 'b>() -> () where 'a: 'b {}
fn outer<'a, 'b>() -> () where 'a: 'b { require::<'a, 'b>; }
fn main() -> () { outer::<'static, 'static>(); }
}])
tc_ok()
);
}
#[test]
fn_value_with_unsatisfied_lifetime_bound() {
alityTest::new(crates![crate Foo {
fn require<'a, 'b>() -> () where 'a: 'b {}
fn outer<'a, 'b>() -> () { require::<'a, 'b>; }
fn main() -> () {}
}])
tc_err(expect_test::expect![[r#"
error: lifetime may not live long enough
--> lib.rs
|
7 | pub fn outer<'a00, 'a01>() -> () {
| ---- ---- lifetime `'a01` defined here
| |
| lifetime `'a00` defined here
8 | require::<'a00, 'a01>;
| ^^^^^^^^^^^^^^^^^^^^^ requires that `'a00` must outlive `'a01`
|
= help: consider adding the following bound: `'a00: 'a01`
error: could not compile `Foo` (lib) due to 1 previous error
)
(expect_test::expect!["crates/formality-rust/src/prove/prove_outlives.rs:8:1: no applicable rules for prove_outlives { a: !lt_0, b: !lt_1, assumptions: {}, env: Env { variables: [!lt_0, !lt_1], bias: Soundness, pending: [], allow_pending_outlives: false } }"]);
}
ound assignment of an integer of a different type should fail.
#[test]
compound_add_mismatched_int_types() {
alityTest::new(crates![crate Foo {
fn foo() -> () {
let x: u32 = 1_u32;
x += 2_u8;
}
Source location: tests/mir_typeck.rs:1438 (all coverage from this test)
fn main() -> () { require_marker::<S>(); }
}])
tc_err(expect_test::expect![[r#"
error[E0277]: the trait bound `S: Marker` is not satisfied
--> lib.rs
|
13 | require_marker::<S>();
| ^ unsatisfied trait bound
|
help: the trait `Marker` is not implemented for `S`
--> lib.rs
|
3 | pub struct S {}
| ^^^^^^^^^^^^
help: this trait has no implementations, consider adding one
--> lib.rs
|
1 | pub trait Marker {}
| ^^^^^^^^^^^^^^^^
note: required by a bound in `require_marker`
--> lib.rs
|
5 | pub fn require_marker<T00>() -> ()
| -------------- required by a bound in this function
6 | where
7 | T00: Marker,
| ^^^^^^ required by this bound in `require_marker`
For more information about this error, try `rustc --explain E0277`.
error: could not compile `test` (lib) due to 1 previous error
)
(expect_test::expect![[r#"
the rule "trait implied bound" at (prove_predicate.rs) failed because
expression evaluated to an empty collection: `decls.trait_invariants()`"#]]);
}
ng the function with a type that implements `Marker` is accepted.
#[test]
generic_fn_value_with_satisfied_where_clause() {
alityTest::new(crates![crate test {
trait Marker {}
impl Marker for u32 {}
fn require_marker<T>() -> () where T: Marker {}
fn main() -> () { require_marker::<u32>; }
}])
tc_ok()
);
}
#[test]
fn_value_with_forwarded_trait_bound() {
alityTest::new(crates![crate Foo {
trait Marker {}
impl Marker for u32 {}
fn require<T>() -> () where T: Marker {}
fn outer<T>() -> () where T: Marker { require::<T>; }
fn main() -> () { outer::<u32>(); }
}])
tc_ok()
);
}
#[test]
bare_fn_value_with_satisfied_where_clause() {
alityTest::new(crates![crate Foo {
trait Marker {}
impl Marker for u32 {}
fn require() -> () where u32: Marker {}
fn main() -> () { require; }
}])
tc_ok()
);
}
#[test]
fn_value_with_forwarded_lifetime_bound() {
alityTest::new(crates![crate Foo {
fn require<'a, 'b>() -> () where 'a: 'b {}
fn outer<'a, 'b>() -> () where 'a: 'b { require::<'a, 'b>; }
fn main() -> () { outer::<'static, 'static>(); }
}])
tc_ok()
);
}
#[test]
fn_value_with_unsatisfied_lifetime_bound() {
alityTest::new(crates![crate Foo {
fn require<'a, 'b>() -> () where 'a: 'b {}
fn outer<'a, 'b>() -> () { require::<'a, 'b>; }
fn main() -> () {}
}])
tc_err(expect_test::expect![[r#"
error: lifetime may not live long enough
--> lib.rs
|
7 | pub fn outer<'a00, 'a01>() -> () {
| ---- ---- lifetime `'a01` defined here
| |
| lifetime `'a00` defined here
8 | require::<'a00, 'a01>;
| ^^^^^^^^^^^^^^^^^^^^^ requires that `'a00` must outlive `'a01`
|
= help: consider adding the following bound: `'a00: 'a01`
error: could not compile `Foo` (lib) due to 1 previous error
)
(expect_test::expect!["crates/formality-rust/src/prove/prove_outlives.rs:8:1: no applicable rules for prove_outlives { a: !lt_0, b: !lt_1, assumptions: {}, env: Env { variables: [!lt_0, !lt_1], bias: Soundness, pending: [], allow_pending_outlives: false } }"]);
}
ound assignment of an integer of a different type should fail.
#[test]
compound_add_mismatched_int_types() {
alityTest::new(crates![crate Foo {
fn foo() -> () {
let x: u32 = 1_u32;
x += 2_u8;
}
Source location: tests/mir_typeck.rs:1514 (all coverage from this test)
fn main() -> () {}
}])
tc_err(expect_test::expect![[r#"
error: lifetime may not live long enough
--> lib.rs
|
7 | pub fn outer<'a00, 'a01>() -> () {
| ---- ---- lifetime `'a01` defined here
| |
| lifetime `'a00` defined here
8 | require::<'a00, 'a01>;
| ^^^^^^^^^^^^^^^^^^^^^ requires that `'a00` must outlive `'a01`
|
= help: consider adding the following bound: `'a00: 'a01`
error: could not compile `Foo` (lib) due to 1 previous error
)
(expect_test::expect!["crates/formality-rust/src/prove/prove_outlives.rs:8:1: no applicable rules for prove_outlives { a: !lt_0, b: !lt_1, assumptions: {}, env: Env { variables: [!lt_0, !lt_1], bias: Soundness, pending: [], allow_pending_outlives: false } }"]);
}
ound assignment of an integer of a different type should fail.
#[test]
compound_add_mismatched_int_types() {
alityTest::new(crates![crate Foo {
fn foo() -> () {
let x: u32 = 1_u32;
x += 2_u8;
}
Source location: tests/mir_typeck.rs:1559 (all coverage from this test)
fn foo() -> () {
let x: u32 = 1_u32;
x += 2_u8;
}
Source location: tests/mir_typeck.rs:1586 (all coverage from this test)
fn foo() -> () {
let x: bool = true;
x += false;
}